{"text_format":"1","workbook":"xlsx","n_sheets":5,"sheets":["Index","General Information","Agenda Items","Taxonomy","TextBlock"],"not_rendered":{"charts":0,"images":1,"macros":1,"external_links":0,"defined_names":1,"comments":0,"pivot_tables":0},"unopened":[],"bounds":{"document_bytes":16777216,"sheet_cells":100000,"rows_first":2000,"rows_last":500,"rows_between":2000,"halvings":0,"cell_chars":16384,"cell_head_chars":4096},"cells_cut":0,"cells_raw":0,"read":"whole","date_system":"1900"}

{"sheet":"Index","index":0,"n_rows":46,"n_cols":10,"rows_kept":46,"cut":false,"hidden":false,"merged":[[45,3,45,9],[39,3,39,9],[40,3,40,9],[41,3,41,9],[42,3,42,9],[43,3,43,9],[44,3,44,9],[36,3,36,9],[22,3,22,9],[25,3,25,9],[26,4,26,8],[27,4,27,8],[30,3,30,9],[31,3,31,9],[32,3,32,9],[33,3,33,9],[34,3,34,9],[35,3,35,9],[21,3,21,9],[5,4,5,8],[6,5,6,8],[7,5,7,8],[8,5,8,8],[10,5,10,8],[13,3,13,9],[14,3,14,9],[17,3,17,9],[18,3,18,9],[19,3,19,9],[20,3,20,9],[9,5,9,8]]}
[]
[]
[]
[]
[]
[null,null,null,null,"                                      XBRL Excel Utility"]
[null,null,null,null,"1.","Overview"]
[null,null,null,null,"2.","Before you begin"]
[null,null,null,null,"3.","Index"]
[null,null,null,null,"4.","Steps for Filing Prior Intimation of Board Meeting Report"]
[null,null,null,null,"5.","Fill up the data in excel utility"]
[]
[]
[null,null,null,"1. Overview"]
[null,null,null,"The excel utility can be used for creating the XBRL/XML file for efiling of Prior Intimation of Board Meeting Report"]
[]
[]
[null,null,null," 2.  Before you begin"]
[null,null,null,"1. The version of Microsoft Excel in your system should be Microsoft Office Excel 2007 and above."]
[null,null,null,"2. The system should have a file compression software to unzip excel utility file."]
[null,null,null,"3. Make sure that you have downloaded the latest Excel Utility."]
[null,null,null,"4. Make sure that you have downloaded the Chrome Browser to view report generated from Excel utility"]
[null,null,null,"5. Please enable the Macros (if disabled) as per instructions given in manual, so that all the functionalities of  Excel Utility works fine. Please first go through Enable Macro - Manual attached with zip file."]
[]
[]
[null,null,null,"3. Index "]
[null,null,null,1,"Basic information about the company and Meeting details",null,null,null,null,"General Information"]
[null,null,null,2,"Agenda Items for Board Meeting",null,null,null,null,"Agenda Items"]
[]
[]
[null,null,null,"4. Steps for Filing Prior Intimation of Board Meeting Report"]
[null,null,null,"I.  Fill up the data: Navigate to each field of every section in the sheet to provide applicable data in correct format.  (Formats will get reflected while filling data.)  \n   - Use paste special command to paste data from other sheet."]
[null,null,null,"II. Validating Sheets:  Click on the ''Validate\" button to ensure that the sheet has been properly filled and also data has been furnished in proper format. If there are some errors on the sheet, excel utility will prompt you about the same."]
[null,null,null,"III. Validate All Sheets:  Click on the ''Home\" button. And then click on \"Validate All Sheet\" button to ensure that all sheets has been properly filled and validated successfully. If there are some errors on the sheet, excel utility will prompt you about the same and stop validation at the same time. After correction, once again follow the same procedure to validate all sheets."]
[null,null,null,"Excel Utility will not allow you to generate XBRL/XML until you rectify all errors. "]
[null,null,null,"IV. Generate XML :   Excel Utility will not allow you to generate XBRL/XML unless successful validation of all sheet is completed. Now click on 'Generate XML'' to generate XBRL/XML file. \n    - Save the XBRL/XML file in your desired folder in local system."]
[null,null,null,"V. Generate Report :   Excel Utility will allow you to generate Report. Now click on 'Generate Report'' to generate html report.   \n     - Save the HTML Report file in your desired folder in local system.     \n     - To view HTML Report open \"Chrome Web Browser\" . \n     - To print report in PDF Format, Click on print button and save as PDF. "]
[]
[]
[null,null,null,"5. Fill up the data in excel utility"]
{"$rows_left_out":7}
{"sheet":"General Information","index":1,"n_rows":730,"n_cols":26,"rows_kept":730,"cut":false,"hidden":false,"merged":[[7,4,7,5]]}
[null,null,null,null,null,null,null,null,null,null,null,null,null,"YES","NO",null,null,null,null,{"$f":"COUNT(W1:W730)-COUNT(Z1:Z18)","v":12},{"$f":"+U2-1","v":"2023-01-26"},{"$f":"WEEKDAY(U1)","v":5},{"$f":"IFERROR(IF(V1=7,\"\",IF(V1=1,\"\",IF(AND(U1>VALUE($F$29),U1<VALUE($F$16)),U1,\"\"))),\"\")","v":""},"2022-01-26",{"$f":"WEEKDAY(X1)","v":4},{"$f":"IFERROR(IF(Y1=7,\"\",IF(Y1=1,\"\",IF(AND(X1>VALUE($F$29),X1<VALUE($F$16)),X1, \"\"))),\"\")","v":""}]
[null,null,null,null,null,null,null,null,null,null,null,null,null,"New","Re-schedule (postpone or prepone)","Cancellation",null,null,null,null,"2023-01-27",{"$f":"WEEKDAY(U2)","v":6},{"$f":"IFERROR(IF(V2=7,\"\",IF(V2=1,\"\",IF(AND(U2>VALUE($F$29),U2<VALUE($F$16)),U2,\"\"))),\"\")","v":""},"2022-03-01",{"$f":"WEEKDAY(X2)","v":3},{"$f":"IFERROR(IF(Y2=7,\"\",IF(Y2=1,\"\",IF(AND(X2>VALUE($F$29),X2<VALUE($F$16)),X2, \"\"))),\"\")","v":""}]
[null,null,null,null,null,null,null,null,null,null,null,null,null,null,null,null,null,null,null,null,"2023-01-28",7,"","2022-03-18",6,""]
[null,null,null,null,null,null,null,null,null,null,null,null,null,null,null,null,null,null,null,null,"2023-01-29",1,"","2022-04-10",1,""]
[null,null,null,null,null,null,null,null,null,null,null,null,null,null,null,null,null,null,null,null,"2023-01-30",2,"","2022-04-14",5,""]
[null,null,null,null,null,null,null,null,null,null,null,null,null,null,null,null,null,null,null,null,"2023-01-31",3,"","2022-04-15",6,""]
[null,null,null,null,null,null,null,null,null,null,null,null,null,null,null,null,null,null,null,null,"2023-02-01",4,"","2022-05-01",1,""]
[null,null,null,null,"General Information",null,null,null,null,null,null,null,null,null,null,null,null,null,null,null,"2023-02-02",5,"","2022-05-03",3,""]
[null,null,null,null,"NSE Symbol*","0",null,null,null,null,null,"NSESymbol",null,null,null,null,null,null,null,null,"2023-02-03",6,"","2022-07-10",1,""]
[null,null,null,null,"Name of the Company*","CITYMAN LIMITED",null,null,null,null,null,"NameOfTheCompany",null,null,null,null,null,null,null,null,"2023-02-04",7,"","2022-08-09",3,""]
[null,null,null,null,"BSE Scrip Code*","521210",null,null,null,null,null,"ScripCode",null,null,null,null,null,{"$f":"IF(T21=\"\",\"\",1)","v":""},{"$f":"IFERROR(SMALL($R$11:$R$18,ROWS(S$11:S11)),\"\")","v":""},{"$f":"IFERROR(INDEX($R$21:$T$28,S11,3),\"\")","v":""},"2023-02-05",1,"","2022-08-15",2,""]
[null,null,null,null,"MSEI Symbol*","NOTLISTED",null,null,null,null,null,"MSEISymbol",null,null,null,null,null,{"$f":"IF(T22=\"\",\"\",2)","v":""},{"$f":"IFERROR(SMALL($R$11:$R$18,ROWS(S$11:S12)),\"\")","v":""},{"$f":"IFERROR(INDEX($R$21:$T$28,S12,3),\"\")","v":""},"2023-02-06",2,"","2022-08-31",4,""]
[null,null,null,null,"Whether Company is SME*","YES",null,null,null,null,null,"WhetherCompanyIsSME",null,null,null,null,null,{"$f":"IF(T23=\"\",\"\",3)","v":""},{"$f":"IFERROR(SMALL($R$11:$R$18,ROWS(S$11:S13)),\"\")","v":""},"","2023-02-07",3,"","2022-10-02",1,""]
[null,null,null,null,"ISIN*","INE117C01010",null,null,null,null,null,"ISIN",null,null,null,null,null,{"$f":"IF(T24=\"\",\"\",4)","v":""},{"$f":"IFERROR(SMALL($R$11:$R$18,ROWS(S$11:S14)),\"\")","v":""},"","2023-02-08",4,"","2022-10-05",4,""]
[null,null,null,null,"Type of Intimation*","New",null,null,null,null,null,"TypeOfIntimation",null,null,null,null,null,{"$f":"IF(T25=\"\",\"\",5)","v":""},{"$f":"IFERROR(SMALL($R$11:$R$18,ROWS(S$11:S15)),\"\")","v":""},"","2023-02-09",5,"","2022-10-24",2,""]
[null,null,null,null,"Proposed Meeting Date","13-02-2024",null,null,null,null,null,"DateOfProposedMeeting",null,null,null,null,null,{"$f":"IF(T26=\"\",\"\",6)","v":""},{"$f":"IFERROR(SMALL($R$11:$R$18,ROWS(S$11:S16)),\"\")","v":""},"","2023-02-10",6,"","2022-10-26",4,""]
[null,null,null,null,"Original Meeting Date",null,null,null,null,null,null,"DateOfOriginalMeeting",null,null,null,null,null,{"$f":"IF(T27=\"\",\"\",7)","v":""},{"$f":"IFERROR(SMALL($R$11:$R$18,ROWS(S$11:S17)),\"\")","v":""},"","2023-02-11",7,"","2022-11-08",3,""]
[null,null,null,null,"Whether trading window is closed*","YES",null,null,null,null,null,"WhetherTradingWindowIsClosed",null,null,null,null,null,{"$f":"IF(T28=\"\",\"\",8)","v":""},{"$f":"IFERROR(SMALL($R$11:$R$18,ROWS(S$11:S18)),\"\")","v":""},"","2023-02-12",1,"","2022-12-25",1,""]
[null,null,null,null,"Trading Window Start date","01-01-2024",null,null,null,null,null,"StartDateOfTradingWindow",null,null,null,null,null,null,null,null,"2023-02-13",2,""]
[null,null,null,null,"Trading Window End date","15-02-2024",null,null,null,null,null,"EndDateOfTradingWindow",null,null,null,null,null,null,null,null,{"$f":"+U21-1","v":"2023-02-14"},3,""]
[null,null,null,null,"Short Notice",{"$f":"IFERROR(IF($F$16=\"\",\"\",IF(T11=\"\",\"\",T11)),\"\")","v":""},null,null,null,null,null,"ShortNotice",null,"Alteration of date of payment of interest or redemption amount",{"$f":"IFERROR(MATCH(N21,'Agenda Items'!$G$12:$G$13,0),\"\")","v":""},"29(3)(b)",{"$f":"IF(O21=\"\",\"\",IF($T$1<11,11-$T$1,\"\"))","v":""},{"$f":"IFERROR(SMALL($O$21:$O$28,ROWS(R$21:R21)),\"\")","v":1},"less than 11 working days",{"$f":"IF(R21<>\"\",IF(VLOOKUP(R21,$O$21:$Q$28,3,0)=\"\",\"\",VLOOKUP(R21,$O$21:$P$28,2,0)&\" - \"&VLOOKUP(R21,$O$21:$Q$28,3,0)),\"\")","v":""},"2023-02-15",4,""]
[null,null,null,null,null,{"$f":"IFERROR(IF($F$16=\"\",\"\",IF(T12=\"\",\"\",T12)),\"\")","v":""},null,null,null,null,null,"ShortNotice1",null,"Alteration of form or nature or rights of securities",{"$f":"IFERROR(MATCH(N22,'Agenda Items'!$G$12:$G$13,0),\"\")","v":""},"29(3)(a)",{"$f":"IF(O22=\"\",\"\",IF($T$1<11,11-$T$1,\"\"))","v":""},{"$f":"IFERROR(SMALL($O$21:$O$28,ROWS(R$21:R22)),\"\")","v":""},"less than 11 working days",{"$f":"IF(R22<>\"\",IF(VLOOKUP(R22,$O$21:$Q$28,3,0)=\"\",\"\",VLOOKUP(R22,$O$21:$P$28,2,0)&\" - \"&VLOOKUP(R22,$O$21:$Q$28,3,0)),\"\")","v":""},"2023-02-16",5,""]
[null,null,null,null,null,"",null,null,null,null,null,"ShortNotice2",null,"Bonus",{"$f":"IFERROR(MATCH(N23,'Agenda Items'!$G$12:$G$13,0),\"\")","v":""},"29(1)(f)",{"$f":"IF(O23=\"\",\"\",IF($T$1<2,2-$T$1,\"\"))","v":""},{"$f":"IFERROR(SMALL($O$21:$O$28,ROWS(R$21:R23)),\"\")","v":""},"less than 2 working days","","2023-02-17",6,""]
[null,null,null,null,null,"",null,null,null,null,null,"ShortNotice3",null,"Buyback",{"$f":"IFERROR(MATCH(N24,'Agenda Items'!$G$12:$G$13,0),\"\")","v":""},"29(1)(b)",{"$f":"IF(O24=\"\",\"\",IF($T$1<2,2-$T$1,\"\"))","v":""},{"$f":"IFERROR(SMALL($O$21:$O$28,ROWS(R$21:R24)),\"\")","v":""},"less than 2 working days","","2023-02-18",7,""]
[null,null,null,null,null,"",null,null,null,null,null,"ShortNotice4",null,"Dividend",{"$f":"IFERROR(MATCH(N25,'Agenda Items'!$G$12:$G$13,0),\"\")","v":""},"29(1)(e)",{"$f":"IF(O25=\"\",\"\",IF($T$1<2,2-$T$1,\"\"))","v":""},{"$f":"IFERROR(SMALL($O$21:$O$28,ROWS(R$21:R25)),\"\")","v":""},"less than 2 working days","","2023-02-19",1,""]
[null,null,null,null,null,"",null,null,null,null,null,"ShortNotice5",null,"Financial results",{"$f":"IFERROR(MATCH(N26,'Agenda Items'!$G$12:$G$13,0),\"\")","v":1},"29(1)(a)",{"$f":"IFERROR(IF(O26=\"\",\"\",IF((F16-F29)-1<5,IF((F16-F29)<1,5,5-(F16-F29)+1),\"\")),\"\")","v":""},{"$f":"IFERROR(SMALL($O$21:$O$28,ROWS(R$21:R26)),\"\")","v":""},"less than 5 Calander days","","2023-02-20",2,""]
[null,null,null,null,null,"",null,null,null,null,null,"ShortNotice6",null,"Fund raising",{"$f":"IFERROR(MATCH(N27,'Agenda Items'!$G$12:$G$13,0),\"\")","v":""},"29(1)(d)",{"$f":"IF(O27=\"\",\"\",IF($T$1<2,2-$T$1,\"\"))","v":""},{"$f":"IFERROR(SMALL($O$21:$O$28,ROWS(R$21:R27)),\"\")","v":""},"less than 2 working days","","2023-02-21",3,""]
[null,null,null,null,null,"",null,null,null,null,null,"ShortNotice7",null,"Voluntary delisting",{"$f":"IFERROR(MATCH(N28,'Agenda Items'!$G$12:$G$13,0),\"\")","v":""},"29(1)(c)",{"$f":"IF(O28=\"\",\"\",IF($T$1<2,2-$T$1,\"\"))","v":""},{"$f":"IFERROR(SMALL($O$21:$O$28,ROWS(R$21:R28)),\"\")","v":""},"less than 2 working days","",{"$f":"+U29-1","v":"2023-02-22"},4,""]
[null,null,null,null,"Date of Report*",{"$f":"TODAY()","v":"2024-01-25"},null,null,null,null,null,"DateOfReport",null,null,null,null,null,null,null,null,"2023-02-23",5,""]
[null,null,null,null,"Remarks for Exchange (not for Website Dissemination)","NA",null,null,null,null,null,"RemarksForExchangeNotForWebsiteDissemination",null,null,null,null,null,null,null,null,"2023-02-24",6,""]
[null,null,null,null,null,null,null,null,null,null,null,null,null,null,null,null,null,null,null,null,"2023-02-25",7,""]
[null,null,null,null,null,null,null,null,null,null,null,null,null,null,null,null,null,null,null,null,"2023-02-26",1,""]
[null,null,null,null,null,null,null,null,null,null,null,null,null,null,null,null,null,null,null,null,"2023-02-27",2,""]
[null,null,null,null,null,null,null,null,null,null,null,null,null,null,null,null,null,null,null,null,"2023-02-28",3,""]
[null,null,null,null,null,null,null,null,null,null,null,null,null,null,null,null,null,null,null,null,"2023-03-01",4,""]
[null,null,null,null,null,null,null,null,null,null,null,null,null,null,null,null,null,null,null,null,"2023-03-02",5,""]
[null,null,null,null,null,null,null,null,null,null,null,null,null,null,null,null,null,null,null,null,"2023-03-03",6,""]
[null,null,null,null,null,null,null,null,null,null,null,null,null,null,null,null,null,null,null,null,"2023-03-04",7,""]
[null,null,null,null,null,null,null,null,null,null,null,null,null,null,null,null,null,null,null,null,"2023-03-05",1,""]
[null,null,null,null,null,null,null,null,null,null,null,null,null,null,null,null,null,null,null,null,"2023-03-06",2,""]
{"$rows_left_out":691}
{"sheet":"Agenda Items","index":2,"n_rows":24,"n_cols":32,"rows_kept":24,"cut":false,"hidden":false,"merged":[[8,4,8,6],[10,4,11,4],[18,4,19,4],[21,4,22,4]]}
[null,null,null,null,null,null,null,null,0,null,null,null,null,"Alteration of date of payment of interest or redemption amount","Alteration of form or nature or rights of securities","Bonus","Buyback","Dividend","Financial results","Fund raising","Voluntary delisting","Amalgamation","Consolidation of shares","Conversions of FCD","Dividend on preference shares","ESOP","Increase in authorised capital","Reduction of capital","Scheme of arrangement","Status of project","Stock split","Other business"]
[null,null,null,null,null,null,null,null,0,null,null,null,null,"Audited","Unaudited"]
[null,null,null,null,null,null,null,null,0,null,null,null,null,"Standalone","Consolidated","Standalone And Consolidated"]
[null,null,null,null,null,null,null,null,null,null,null,null,null,"Quarterly","Half Yearly","Yearly"]
[null,null,null,null,null,"2012",2013,2014,2015,2016,2017,2018,2019,2020,2021,2022,2023,2024,2025,2026,2027,2028,2029,2030,2031,2032]
[null,null,null,null,null,null,null,null,null,null,null,null,null,"March","June","September","December"]
[null,null,null,null,null,null,null,null,null,null,null,null,null,"American Depository Receipts or Global Depository Receipts or Foreign Currency Convertible Bonds","Debt issue","Further public offer","Preferential issue","Qualified institutions placement","Rights issue","Any other method","To be ascertained"]
[null,null,null,null,null,null,null,null,null,null,null,null,null,"Final","Interim","Other"]
[null,null,null,null,"Agenda Details"]
[null,null,null,null,null,null,null,null,null,null,null,"Agenda1"]
[null,null,null,null,"Agenda*"]
[null,null,null,null,null,1,"Financial results",null,null,null,null,"Agenda"]
[null,null,null,null,"Whether results are audited or unaudited",null,"Unaudited",null,null,null,null,"WhetherResultsAreAuditedOrUnaudited"]
[null,null,null,null,"Nature of report standalone or consolidated",null,"Standalone",null,null,null,null,"NatureOfReportStandaloneConsolidated"]
[null,null,null,null,"Period end Type",null,"Quarterly",null,null,null,null,"ReportingPeriodType"]
[null,null,null,null,"Period up to (Month)",null,"December",null,null,null,null,"MonthOfPeriodEnded"]
[null,null,null,null,"Period up to (Year)",null,2023,null,null,null,null,"YearOfPeriodEnded"]
[null,null,null,null,null,null,null,null,null,null,null,"ModeOfRaisingFunds"]
[null,null,null,null,"Mode of raising Funds"]
[null,null,null,null,null,1,null,null,null,null,null,"ModeOfRaisingFunds"]
[null,null,null,null,null,null,null,null,null,null,null,"TypeOfDividend"]
[null,null,null,null,"Type of Dividend"]
[null,null,null,null,null,1,null,null,null,null,null,"TypeOfDividend"]
[null,null,null,null,"Remarks (website dissemination)",null,"NA",null,null,null,null,"RemarksWebsiteDissemination"]

{"sheet":"Taxonomy","index":3,"n_rows":68,"n_cols":6,"rows_kept":68,"cut":false,"hidden":true,"merged":[]}
[null,"Lable name",null,null,"Validation msg"]
["NSESymbol","NSE Symbol*","xbrli:stringItemType","instant","1) This is mandatory field.\n2) space is not allowed.\n3) Please enter valid NSE symbol. "]
["NameOfTheCompany","Name of the Company*","xbrli:stringItemType","instant","This is a mandatory field."]
["ScripCode","BSE Scrip Code*","in-capmkt-types:ScripCode","instant","1) This is a mandatory field.\n2) Please enter 6 digit Scrip Code."]
["MSEISymbol","MSEI Symbol*","xbrli:stringItemType","instant","1) This is mandatory field.\n2) Space is not allowed.\n3) Maximum 20 Character allowed.\n4) Please enter valid MSEI symbol. "]
["WhetherCompanyIsSME","Whether Company is SME*","xbrli:booleanItemType","duration","1) This is a mandatory field.\n2) Please select value from drop down."]
["ISIN","ISIN*","in-capmkt-types:ISINNumber","instant","1) This is a mandatory field.\n2) Please enter ISIN Number format."]
["TypeOfIntimation","Type of Intimation*","in-capmkt-types:IntimationType","duration","1) This is a mandatory field.\n2) Please select value from drop down."]
["DateOfProposedMeeting","Proposed Meeting Date","xbrli:dateItemType","duration","1) This is a mandatory field.\n2) Please enter date in DD-MM-YYYY format.\n3) Date should be today or future date"]
["DateOfOriginalMeeting","Original Meeting Date","xbrli:dateItemType","duration","1) This is a mandatory field.\n2) Please enter date in DD-MM-YYYY format.","1) This is a mandatory field.\n2) Please enter date in DD-MM-YYYY format.\n3) Date should be past date or before today"]
["WhetherTradingWindowIsClosed","Whether trading window is closed*","xbrli:booleanItemType","duration","1) This is a mandatory field.\n2) Please select value from drop down."]
["StartDateOfTradingWindow","Trading Window Start date","xbrli:dateItemType","duration","1) This is a mandatory field.\n2) Please enter date in DD-MM-YYYY format."]
["EndDateOfTradingWindow","Trading Window End date","xbrli:dateItemType","duration","1) This is a mandatory field.\n2) Please enter date in DD-MM-YYYY format."]
["ShortNotice","Short Notice","xbrli:stringItemType","instant","1) This is a mandatory field.\n2) Please enter date in DD-MM-YYYY format."]
[null,"Agenda*",null,null,"1) This is a mandatory field.\n2) Please select value from drop down.","1) This is a mandatory field.\n2) Please select value from drop down.\n3) Duplicate values are not allowed"]
[null,"Whether results are audited or unaudited",null,null,"1) This is a mandatory field.\n2) Please select value from drop down."]
[null,"Nature of report standalone or consolidated",null,null,"1) This is a mandatory field.\n2) Please select value from drop down."]
[null,"Period end Type",null,null,"1) This is a mandatory field.\n2) Please select value from drop down."]
[null,"Period up to (Month)",null,null,"1) This is a mandatory field.\n2) Please select value from drop down."]
[null,"Period up to (Year)",null,null,"1) This is a mandatory field.\n2) Please select value from drop down."]
[null,"Mode of raising Funds",null,null,"1) This is a mandatory field.\n2) Please select value from drop down.","1) This is a mandatory field.\n2) Please select value from drop down.\n3) Duplicate values are not allowed"]
[null,"Type of Dividend",null,null,"1) This is a mandatory field.\n2) Please select value from drop down.","1) This is a mandatory field.\n2) Please select value from drop down.\n3) Duplicate values are not allowed"]
["RemarksForExchangeNotForWebsiteDissemination","Remarks for Exchange (not for Website Dissemination)","xbrli:stringItemType","instant","1) This is a mandatory field.\n2) Maximum 5000 Character allow."]
["DateOfReport",null,"xbrli:dateItemType","instant"]
["Agenda1",null,"in-capmkt-types:TypeOfAgenda","duration"]
["Agenda2",null,"in-capmkt-types:TypeOfAgenda","duration"]
["Agenda3",null,"in-capmkt-types:TypeOfAgenda","duration"]
["Agenda4",null,"in-capmkt-types:TypeOfAgenda","duration"]
["Agenda5",null,"in-capmkt-types:TypeOfAgenda","duration"]
["Agenda6",null,"in-capmkt-types:TypeOfAgenda","duration"]
["Agenda7",null,"in-capmkt-types:TypeOfAgenda","duration"]
["Agenda8",null,"in-capmkt-types:TypeOfAgenda","duration"]
["Agenda9",null,"in-capmkt-types:TypeOfAgenda","duration"]
["Agenda10",null,"in-capmkt-types:TypeOfAgenda","duration"]
["Agenda11",null,"in-capmkt-types:TypeOfAgenda","duration"]
["Agenda12",null,"in-capmkt-types:TypeOfAgenda","duration"]
["Agenda13",null,"in-capmkt-types:TypeOfAgenda","duration"]
["Agenda14",null,"in-capmkt-types:TypeOfAgenda","duration"]
["Agenda15",null,"in-capmkt-types:TypeOfAgenda","duration"]
["Agenda16",null,"in-capmkt-types:TypeOfAgenda","duration"]
{"$rows_left_out":29}
{"sheet":"TextBlock","index":4,"n_rows":0,"n_cols":0,"rows_kept":0,"cut":false,"hidden":true,"merged":[]}